Target
Renin
Ligand
BDBM50281001
Substrate
Meas. Tech.
ChEBML_192729
IC50
11±n/a nM
Citation
 Plummer, MHamby, JMHingorani, GBatley, BLRapundalo, ST Peptidomimetic inhibitors of renin incorporating topographically modified isosteres spanning the P1(→ P3)-P1' sites Bioorg Med Chem Lett 3:2119-2124 (1993)    Article 
Target
Name:
Renin
Synonyms:
Angiotensinogenase RENI_HUMAN
Type:
Enzyme
Mol. Mass.:
45058.99
Organism:
Homo sapiens (Human)
Description:
Residue:
406
  
Inhibitor
Name:
BDBM50281001
Synonyms:
(S)-2-[2-(Morpholine-4-sulfonylamino)-acetylamino]-pent-4-enoic acid [(1S,2R,3S)-2,3-dihydroxy-5-methyl-1-(4-naphthalen-1-yl-cyclohexylmethyl)-hexyl]-amide | CHEMBL308894
Type:
Small organic molecule
Emp. Form.:
C35H52N4O7S
Mol. Mass.:
672.875
SMILES:
CC(C)C[C@H](O)[C@H](O)[C@H](CC1CCC(CC1)c1cccc2ccccc12)NC(=O)[C@H](CC=C)NC(=O)CNS(=O)(=O)N1CCOCC1
: