Target
Scytalone dehydratase
Ligand
BDBM50282106
Substrate
Meas. Tech.
ChEMBL_199537 (CHEMBL801406)
pH
7±n/a
Ki
1800±n/a nM
Comments
extracted
Citation
 Hodge, CPierce, J A diazine heterocycle replaces a six-membered hydrogen-bonded array in the active site of scytalone dehydratase Bioorg Med Chem Lett 3:1605-1608 (1993)    Article 
Target
Name:
Scytalone dehydratase
Synonyms:
SCYD_MAGO7 Scytalone dehydratase
Type:
PROTEIN
Mol. Mass.:
20248.63
Organism:
Magnaporthe grisea
Description:
ChEMBL_199536
Residue:
172
  
Inhibitor
Name:
BDBM50282106
Synonyms:
(3-Phenyl-propyl)-quinazolin-4-yl-amine N-(3-phenylpropyl)quinazolin-4-amine
Type:
Small organic molecule
Emp. Form.:
C17H17N3
Mol. Mass.:
263.337
SMILES:
C(CNc1ncnc2ccccc12)Cc1ccccc1
: