Target
Type-1 angiotensin II receptor
Ligand
BDBM50282334
Substrate
Meas. Tech.
ChEBML_36947
IC50
11±n/a nM
Citation
 Kim, DMantlo, NBTata, JRFitch, KDhanoa, DOwens, KLevorse, DSiegl, PKChang, RSChen, TScheck, SZingaro, GJKivlighn, SDGreenlee, WJ Acidic phenols: a new class of potent nonpeptide angiotensin II receptor antagonists Bioorg Med Chem Lett 4:207-212 (1994)    Article 
Target
Name:
Type-1 angiotensin II receptor
Synonyms:
AGTR1 ANGIOTENSIN AT1 Angiotensin II type 1a (AT-1a) receptor
Type:
Enzyme Catalytic Domain
Mol. Mass.:
41009.15
Organism:
RABBIT
Description:
ANGIOTENSIN AT1 AGTR1 RABBIT::P34976
Residue:
359
  
Inhibitor
Name:
BDBM50282334
Synonyms:
3-(3,5-Dibromo-4-hydroxy-benzyl)-7-methyl-2-propyl-3H-imidazo[4,5-b]pyridine-5-carboxylic acid | CHEMBL293926
Type:
Small organic molecule
Emp. Form.:
C18H17Br2N3O3
Mol. Mass.:
483.154
SMILES:
CCCc1nc2c(C)cc(nc2n1Cc1cc(Br)c(O)c(Br)c1)C(O)=O
: