Target
Protein kinase C beta type
Ligand
BDBM50282633
Substrate
Meas. Tech.
ChEMBL_160470 (CHEMBL761766)
IC50
28±n/a nM
Citation
 Davis, PDHallam, TJHarris, WHill, CHLawton, GNixon, JSSmith, JLVesey, DRWilkinson, SE Bisindolylmaleimide inhibitors of protein kinase C. Further conformational restriction of a tertiary amine side chain. Bioorg Med Chem Lett 4:1303-1308 (1994)    Article 
Target
Name:
Protein kinase C beta type
Synonyms:
KPCB_RAT Pkcb Prkcb1 Protein kinase C (PKC) | Protein kinase C beta
Type:
Enzyme Mixture
Mol. Mass.:
76755.54
Organism:
Rattus norvegicus (rat)
Description:
PKC from rat brain is known to contain predominately the conventional PKC isoforms, alpha, beta I, beta II, gamma.
Residue:
671
  
Inhibitor
Name:
BDBM50282633
Synonyms:
(S)-3-(8-((dimethylamino)methyl)-6,7,8,9-tetrahydropyrido[1,2-a]indol-10-yl)-4-(1-methyl-1H-indol-3-yl)-1H-pyrrole-2,5-dione CHEMBL26501 | Ro-32-0432
Type:
Small organic molecule
Emp. Form.:
C28H28N4O2
Mol. Mass.:
452.5475
SMILES:
CN(C)C[C@H]1CCn2c(C1)c(C1=C(C(=O)NC1=O)c1cn(C)c3ccccc13)c1ccccc21
: