Target
Protein kinase C beta type
Ligand
BDBM50282632
Substrate
Meas. Tech.
ChEMBL_160451 (CHEMBL762482)
IC50
6.8±n/a nM
Citation
 Davis, PDHallam, TJHarris, WHill, CHLawton, GNixon, JSSmith, JLVesey, DRWilkinson, SE Bisindolylmaleimide inhibitors of protein kinase C. Further conformational restriction of a tertiary amine side chain. Bioorg Med Chem Lett 4:1303-1308 (1994)    Article 
Target
Name:
Protein kinase C beta type
Synonyms:
KPCB_RAT Pkcb Prkcb1 Protein kinase C (PKC) | Protein kinase C beta
Type:
Enzyme Mixture
Mol. Mass.:
76755.54
Organism:
Rattus norvegicus (rat)
Description:
PKC from rat brain is known to contain predominately the conventional PKC isoforms, alpha, beta I, beta II, gamma.
Residue:
671
  
Inhibitor
Name:
BDBM50282632
Synonyms:
3-((3aR,10aR)-2-Methyl-2,3,3a,4,10,10a-hexahydro-1H-2,4a-diaza-cyclopenta[b]fluoren-9-yl)-4-(1-methyl-1H-indol-3-yl)-pyrrole-2,5-dione; hydrochloride Ro-32-0557
Type:
Small organic molecule
Emp. Form.:
C28H26N4O2
Mol. Mass.:
450.5316
SMILES:
CN1C[C@@H]2Cc3c(C4=C(C(=O)NC4=O)c4cn(C)c5ccccc45)c4ccccc4n3C[C@H]2C1
: