Target
Mu-type opioid receptor
Ligand
BDBM50283518
Substrate
Meas. Tech.
ChEMBL_136092 (CHEMBL884714)
IC50
6400±n/a nM
Citation
 Hedberg, MHJohansson, AMFowler, CJTerenius, LHacksell, U Palladium-catalyzed synthesis of C3-substituted 3-deoxymorphines. Bioorg Med Chem Lett 4:2527-2532 (1994)    Article 
Target
Name:
Mu-type opioid receptor
Synonyms:
M-OR-1 Mu opioid receptor OPIATE Mu OPRM_CAVPO
Type:
Enzyme Catalytic Domain
Mol. Mass.:
11165.58
Organism:
GUINEA PIG
Description:
P97266
Residue:
98
  
Inhibitor
Name:
BDBM50283518
Synonyms:
14-hydroxy-4-methyl-(1S,5R,13R,14S,17R)-12-oxa-4-azapentacyclo[9.6.1.01,13.05,17.07,18]octadeca-7(18),8,10,15-tetraen-10-yl trifluoromethanesulfonate | CHEMBL440694
Type:
Small organic molecule
Emp. Form.:
C18H18F3NO5S
Mol. Mass.:
417.399
SMILES:
CN1CC[C@@]23[C@H]4Oc5c2c(C[C@@H]1[C@@H]3C=C[C@@H]4O)ccc5OS(=O)(=O)C(F)(F)F
: