Target
Type-2 angiotensin II receptor
Ligand
BDBM50030732
Substrate
Meas. Tech.
ChEMBL_36765 (CHEMBL651095)
IC50
0.170000±n/a nM
Citation
 Chang, LLAshton, WTFlanagan, KLRivero, RAChen, TBO'Malley, SSZingaro, GJKivlighn, SDSiegl, PKLotti, VJChang, RSGreenlee, WJ Potent triazolinone-based angiotensin II receptor antagonists with equivalent affinity for both the AT1 and AT2 subtypes Bioorg Med Chem Lett 4:2787-2792 (1994)    Article 
Target
Name:
Type-2 angiotensin II receptor
Synonyms:
AGTR2_RAT Agtr2 Angiotensin II receptor Type-2 angiotensin II receptor
Type:
Enzyme Catalytic Domain
Mol. Mass.:
41346.62
Organism:
RAT
Description:
Angiotensin II AT2 0 0::P35351
Residue:
363
  
Inhibitor
Name:
BDBM50030732
Synonyms:
CHEMBL323506 N-{3-[3-Butyl-4-(3-fluoro-5'-propyl-2'-(N-t-butyloxycarbonyl)-Sulfanamido-biphenyl-4-ylmethyl)-5-oxo-4,5-dihydro-[1,2,4]triazol-1-yl]-4-chloro-phenyl}-acetamide
Type:
Small organic molecule
Emp. Form.:
C35H41ClFN5O6S
Mol. Mass.:
714.246
SMILES:
CCCCc1nn(-c2cc(NC(C)=O)ccc2Cl)c(=O)n1Cc1ccc(cc1F)-c1cc(CCC)ccc1S(=O)(=O)NC(=O)OC(C)(C)C
: