Target
Gag-Pol polyprotein [489-587]
Ligand
BDBM50283813
Substrate
Meas. Tech.
ChEBML_79969
Ki
430±n/a nM
Citation
 Ettmayer, PHübner, MAndreas, BBrigitte, RHubert, G Novel, extended transition state mimic in HIV-1 protease inhibitors with peripheral C-2-symmetry Bioorg Med Chem Lett 4:2851-2856 (1994)    Article 
Target
Name:
Gag-Pol polyprotein [489-587]
Synonyms:
Human immunodeficiency virus type 1 protease Pol polyprotein | gag-pol
Type:
Enzyme Subunit
Mol. Mass.:
10781.16
Organism:
Human immunodeficiency virus type 1
Description:
P04585[489-587]
Residue:
99
  
Inhibitor
Name:
BDBM50283813
Synonyms:
(2R,3S,4S)-4-((S)-2-Benzyloxycarbonylamino-3-methyl-butyrylamino)-2-[(S)-1-(2-benzyloxycarbonylamino-3-methyl-butyrylamino)-2-phenyl-ethyl]-3-hydroxy-5-phenyl-pentanoic acid | CHEMBL95448
Type:
Small organic molecule
Emp. Form.:
C45H54N4O9
Mol. Mass.:
794.9317
SMILES:
CC(C)[C@H](NC(=O)OCc1ccccc1)C(=O)N[C@@H](Cc1ccccc1)[C@@H](O)[C@@H]([C@H](Cc1ccccc1)NC(=O)C(NC(=O)OCc1ccccc1)C(C)C)C(O)=O
: