Target
Gag-Pol polyprotein [489-587]
Ligand
BDBM50283817
Substrate
Meas. Tech.
ChEBML_79969
Ki
510±n/a nM
Citation
 Ettmayer, PHübner, MAndreas, BBrigitte, RHubert, G Novel, extended transition state mimic in HIV-1 protease inhibitors with peripheral C-2-symmetry Bioorg Med Chem Lett 4:2851-2856 (1994)    Article 
Target
Name:
Gag-Pol polyprotein [489-587]
Synonyms:
Human immunodeficiency virus type 1 protease Pol polyprotein | gag-pol
Type:
Enzyme Subunit
Mol. Mass.:
10781.16
Organism:
Human immunodeficiency virus type 1
Description:
P04585[489-587]
Residue:
99
  
Inhibitor
Name:
BDBM50283817
Synonyms:
CHEMBL98015 | {1-[(1S,2R,3R,4S)-1-Benzyl-4-((S)-2-benzyloxycarbonylamino-3-methyl-butyrylamino)-3-hydroxy-2-hydroxymethyl-5-phenyl-pentylcarbamoyl]-2-methyl-propyl}-carbamic acid benzyl ester
Type:
Small organic molecule
Emp. Form.:
C45H56N4O8
Mol. Mass.:
780.9481
SMILES:
CC(C)[C@H](NC(=O)OCc1ccccc1)C(=O)N[C@@H](Cc1ccccc1)[C@H](O)[C@@H](CO)[C@H](Cc1ccccc1)NC(=O)C(NC(=O)OCc1ccccc1)C(C)C
: