Target
Peptidyl-prolyl cis-trans isomerase FKBP1A
Ligand
BDBM50284184
Substrate
Meas. Tech.
ChEBML_66281
EC50
23±n/a nM
Citation
 Goulet, MTHodkey, DWStaruch, MJDumont, FJCryan, JGParsons, WHWyvratt, MJ Alkyl ether analogs of the FK-506 related, immunosuppressive macrolide L-683,590 (ascomycin) Bioorg Med Chem Lett 4:921-926 (1994)    Article 
Target
Name:
Peptidyl-prolyl cis-trans isomerase FKBP1A
Synonyms:
12 kDa FK506-binding protein FK506-binding protein 1A FKB1A_HUMAN FKBP-1A FKBP12 Immunophilin FKBP12 PPIase FKBP1A Rotamase mTOR/FKBP12A/FKBP12B
Type:
Isomerase
Mol. Mass.:
11953.09
Organism:
Homo sapiens (Human)
Description:
P62942
Residue:
108
  
Inhibitor
Name:
BDBM50284184
Synonyms:
C32-O-cinnamyl ether analogue of L-683590 | CHEMBL262492
Type:
Small organic molecule
Emp. Form.:
C52H76BrNO12
Mol. Mass.:
987.063
SMILES:
CC[C@@H]1\C=C(C)\C[C@H](C)C[C@H](OC)[C@H]2O[C@](O)([C@H](C)C[C@@H]2OC)C(=O)C(=O)N2CCCC[C@H]2C(=O)O[C@@H]([C@H](C)[C@@H](O)CC1=O)C(\C)=C\[C@@H]1CC[C@@H](OC\C=C\c2ccc(Br)cc2)[C@@H](C1)OC
: