Target
5-hydroxytryptamine receptor 1A
Ligand
BDBM50086863
Substrate
Meas. Tech.
ChEMBL_1158 (CHEMBL616103)
Ki
430±n/a nM
Citation
 Kuroita, TIkebe, TMurakami, STakehara, SKawakita, T N-(2-pyrrolidinylmethyl)benzoxazine-8-carboxamides exhibiting high affinities for All of D2, 5-HT1 A, and 5-HT2 receptors Bioorg Med Chem Lett 5:1245-1250 (1995)    Article 
Target
Name:
5-hydroxytryptamine receptor 1A
Synonyms:
5-HT-1A 5-HT1A 5-hydroxytryptamine receptor 1A (5HT1A) 5ht1a Htr1a Serotonin 1a (5-HT1a) receptor/Adrenergic receptor alpha-1 | Serotonin receptor 1A
Type:
G Protein-Coupled Receptor (GPCR)
Mol. Mass.:
46445.29
Organism:
Rattus norvegicus (rat)
Description:
Binding assays were performed using rat hippocampal membranes.
Residue:
422
  
Inhibitor
Name:
BDBM50086863
Synonyms:
6-Chloro-4-methyl-3,4-dihydro-2H-benzo[1,4]oxazine-8-carboxylic acid ((R)-1-butyl-pyrrolidin-2-ylmethyl)-amide | CHEMBL279729
Type:
Small organic molecule
Emp. Form.:
C19H28ClN3O2
Mol. Mass.:
365.898
SMILES:
CCCCN1CCC[C@@H]1CNC(=O)c1cc(Cl)cc2N(C)CCOc12
: