Target
D(2) dopamine receptor
Ligand
BDBM50284591
Substrate
Meas. Tech.
ChEMBL_58484 (CHEMBL670415)
Ki
84±n/a nM
Citation
 Kuroita, TIkebe, TMurakami, STakehara, SKawakita, T N-(2-pyrrolidinylmethyl)benzoxazine-8-carboxamides exhibiting high affinities for All of D2, 5-HT1 A, and 5-HT2 receptors Bioorg Med Chem Lett 5:1245-1250 (1995)    Article 
Target
Name:
D(2) dopamine receptor
Synonyms:
DOPAMINE D2 DOPAMINE D2 Short Dopamine D2 receptor Drd2
Type:
G Protein-Coupled Receptor (GPCR)
Mol. Mass.:
50931.60
Organism:
Rattus norvegicus (rat)
Description:
P61169
Residue:
444
  
Inhibitor
Name:
BDBM50284591
Synonyms:
5-Chloro-2,3-dihydro-benzofuran-7-carboxylic acid ((R)-1-nonyl-pyrrolidin-2-ylmethyl)-amide | CHEMBL278838
Type:
Small organic molecule
Emp. Form.:
C23H35ClN2O2
Mol. Mass.:
406.989
SMILES:
CCCCCCCCCN1CCC[C@@H]1CNC(=O)c1cc(Cl)cc2CCOc12
: