Target
D(2) dopamine receptor
Ligand
BDBM50284602
Substrate
Meas. Tech.
ChEMBL_58484 (CHEMBL670415)
Ki
210±n/a nM
Citation
 Kuroita, TIkebe, TMurakami, STakehara, SKawakita, T N-(2-pyrrolidinylmethyl)benzoxazine-8-carboxamides exhibiting high affinities for All of D2, 5-HT1 A, and 5-HT2 receptors Bioorg Med Chem Lett 5:1245-1250 (1995)    Article 
Target
Name:
D(2) dopamine receptor
Synonyms:
DOPAMINE D2 DOPAMINE D2 Short Dopamine D2 receptor Drd2
Type:
G Protein-Coupled Receptor (GPCR)
Mol. Mass.:
50931.60
Organism:
Rattus norvegicus (rat)
Description:
P61169
Residue:
444
  
Inhibitor
Name:
BDBM50284602
Synonyms:
6-Chloro-4-methyl-3,4-dihydro-2H-benzo[1,4]oxazine-8-carboxylic acid ((R)-1-benzyl-pyrrolidin-2-ylmethyl)-amide | CHEMBL22468
Type:
Small organic molecule
Emp. Form.:
C22H26ClN3O2
Mol. Mass.:
399.914
SMILES:
CN1CCOc2c1cc(Cl)cc2C(=O)NC[C@H]1CCCN1Cc1ccccc1
: