Target
D(2) dopamine receptor
Ligand
BDBM50284607
Substrate
Meas. Tech.
ChEMBL_58484 (CHEMBL670415)
Ki
92±n/a nM
Citation
 Kuroita, TIkebe, TMurakami, STakehara, SKawakita, T N-(2-pyrrolidinylmethyl)benzoxazine-8-carboxamides exhibiting high affinities for All of D2, 5-HT1 A, and 5-HT2 receptors Bioorg Med Chem Lett 5:1245-1250 (1995)    Article 
Target
Name:
D(2) dopamine receptor
Synonyms:
DOPAMINE D2 DOPAMINE D2 Short Dopamine D2 receptor Drd2
Type:
G Protein-Coupled Receptor (GPCR)
Mol. Mass.:
50931.60
Organism:
Rattus norvegicus (rat)
Description:
P61169
Residue:
444
  
Inhibitor
Name:
BDBM50284607
Synonyms:
2-Methoxy-N-((R)-1-nonyl-pyrrolidin-2-ylmethyl)-5-sulfamoyl-benzamide | CHEMBL21940
Type:
Small organic molecule
Emp. Form.:
C22H37N3O4S
Mol. Mass.:
439.612
SMILES:
CCCCCCCCCN1CCC[C@@H]1CNC(=O)c1cc(ccc1OC)S(N)(=O)=O
: