Target
D(2) dopamine receptor
Ligand
BDBM50284586
Substrate
Meas. Tech.
ChEMBL_58485 (CHEMBL670416)
Ki
51±n/a nM
Citation
 Kuroita, TIkebe, TMurakami, STakehara, SKawakita, T N-(2-pyrrolidinylmethyl)benzoxazine-8-carboxamides exhibiting high affinities for All of D2, 5-HT1 A, and 5-HT2 receptors Bioorg Med Chem Lett 5:1245-1250 (1995)    Article 
Target
Name:
D(2) dopamine receptor
Synonyms:
DOPAMINE D2 DOPAMINE D2 Short Dopamine D2 receptor Drd2
Type:
G Protein-Coupled Receptor (GPCR)
Mol. Mass.:
50931.60
Organism:
Rattus norvegicus (rat)
Description:
P61169
Residue:
444
  
Inhibitor
Name:
BDBM50284586
Synonyms:
CHEMBL22857 | N-((S)-1-Butyl-pyrrolidin-2-ylmethyl)-2-methoxy-5-sulfamoyl-benzamide
Type:
Small organic molecule
Emp. Form.:
C17H27N3O4S
Mol. Mass.:
369.479
SMILES:
CCCCN1CCC[C@H]1CNC(=O)c1cc(ccc1OC)S(N)(=O)=O
: