Target
D(2) dopamine receptor
Ligand
BDBM50284606
Substrate
Meas. Tech.
ChEMBL_58485 (CHEMBL670416)
Ki
270±n/a nM
Citation
 Kuroita, TIkebe, TMurakami, STakehara, SKawakita, T N-(2-pyrrolidinylmethyl)benzoxazine-8-carboxamides exhibiting high affinities for All of D2, 5-HT1 A, and 5-HT2 receptors Bioorg Med Chem Lett 5:1245-1250 (1995)    Article 
Target
Name:
D(2) dopamine receptor
Synonyms:
DOPAMINE D2 DOPAMINE D2 Short Dopamine D2 receptor Drd2
Type:
G Protein-Coupled Receptor (GPCR)
Mol. Mass.:
50931.60
Organism:
Rattus norvegicus (rat)
Description:
P61169
Residue:
444
  
Inhibitor
Name:
BDBM50284606
Synonyms:
4-Methyl-3,4-dihydro-2H-benzo[1,4]oxazine-8-carboxylic acid (1-butyl-pyrrolidin-2-ylmethyl)-amide | CHEMBL22465
Type:
Small organic molecule
Emp. Form.:
C19H29N3O2
Mol. Mass.:
331.4525
SMILES:
CCCCN1CCCC1CNC(=O)c1cccc2N(C)CCOc12
: