Target
Caspase-1
Ligand
BDBM50284744
Substrate
Meas. Tech.
ChEMBL_90978 (CHEMBL696525)
Ki
90±n/a nM
Citation
 Mjalli, AMZhao, JJChapman, KTThornberry, NAPeterson, EPMacCoss, MHagmann, WK Inhibition of interleukin-1β converting enzyme by N-acyl-aspartyl aryloxymethyl ketones Bioorg Med Chem Lett 5:1409-1414 (1995)    Article 
Target
Name:
Caspase-1
Synonyms:
CASP1 Caspase ICE IL1BCE Interleukin-1 beta-converting enzyme
Type:
Enzyme
Mol. Mass.:
45154.13
Organism:
Homo sapiens (Human)
Description:
P29466
Residue:
404
  
Inhibitor
Name:
BDBM50284744
Synonyms:
3-Allyloxycarbonylamino-5-[3-(1H-imidazol-2-yl)-naphthalen-2-yloxy]-4-oxo-pentanoic acid | CHEMBL31094
Type:
Small organic molecule
Emp. Form.:
C22H21N3O6
Mol. Mass.:
423.4186
SMILES:
OC(=O)C[C@H](NC(=O)OCC=C)C(=O)COc1cc2ccccc2cc1-c1ncc[nH]1
: