Target
Caspase-1
Ligand
BDBM50284741
Substrate
Meas. Tech.
ChEBML_90989
Ki
2600±n/a nM
Citation
 Mjalli, AMZhao, JJChapman, KTThornberry, NAPeterson, EPMacCoss, MHagmann, WK Inhibition of interleukin-1β converting enzyme by N-acyl-aspartyl aryloxymethyl ketones Bioorg Med Chem Lett 5:1409-1414 (1995)    Article 
Target
Name:
Caspase-1
Synonyms:
CASP1 Caspase ICE IL1BCE Interleukin-1 beta-converting enzyme
Type:
Enzyme
Mol. Mass.:
45154.13
Organism:
Homo sapiens (Human)
Description:
P29466
Residue:
404
  
Inhibitor
Name:
BDBM50284741
Synonyms:
3-(3-Allyloxycarbonylamino-4-carboxy-2-oxo-butoxy)-naphthalene-2-carboxylic acid methyl ester | CHEMBL30664
Type:
Small organic molecule
Emp. Form.:
C21H21NO8
Mol. Mass.:
415.3933
SMILES:
COC(=O)c1cc2ccccc2cc1OCC(=O)C(CC(O)=O)NC(=O)OCC=C
: