Target
Caspase-1
Ligand
BDBM50284746
Substrate
Meas. Tech.
ChEBML_90989
Ki
>100000±n/a nM
Citation
 Mjalli, AMZhao, JJChapman, KTThornberry, NAPeterson, EPMacCoss, MHagmann, WK Inhibition of interleukin-1β converting enzyme by N-acyl-aspartyl aryloxymethyl ketones Bioorg Med Chem Lett 5:1409-1414 (1995)    Article 
Target
Name:
Caspase-1
Synonyms:
CASP1 Caspase ICE IL1BCE Interleukin-1 beta-converting enzyme
Type:
Enzyme
Mol. Mass.:
45154.13
Organism:
Homo sapiens (Human)
Description:
P29466
Residue:
404
  
Inhibitor
Name:
BDBM50284746
Synonyms:
3-Allyloxycarbonylamino-6-[3-(1H-imidazol-2-yl)-naphthalen-2-yl]-4-oxo-hexanoic acid | CHEMBL416941
Type:
Small organic molecule
Emp. Form.:
C23H23N3O5
Mol. Mass.:
421.4458
SMILES:
OC(=O)C[C@H](NC(=O)OCC=C)C(=O)CCc1cc2ccccc2cc1-c1ncc[nH]1
: