Target
Beta-lactamase 1
Ligand
BDBM50285120
Substrate
Meas. Tech.
ChEBML_40228
IC50
>3000000±n/a nM
Citation
 Danelon, GOMata, EGMascaretti, OAGirardini, JMarro, MRoveri, OA Synthesis and β-lactamase inhibitory evaluation of novel 6α-halo-2β-chloromethyl-2α-methylpenam-3α-carboxylic acids and their sulfones and 6α-halo-2β-mercaptobenzothiazolylmethyl-2α-methylpenam-3α-carboxylic acids Bioorg Med Chem Lett 5:2037-2040 (1995)    Article 
Target
Name:
Beta-lactamase 1
Synonyms:
BLAC_BACCE | blaY
Type:
PROTEIN
Mol. Mass.:
33326.66
Organism:
Bacillus cereus
Description:
ChEMBL_40230
Residue:
306
  
Inhibitor
Name:
BDBM50285120
Synonyms:
(2S,3R,5R,6S)-3-Chloromethyl-6-fluoro-3-methyl-4,4,7-trioxo-4lambda*6*-thia-1-aza-bicyclo[3.2.0]heptane-2-carboxylic acid | CHEMBL64818
Type:
Small organic molecule
Emp. Form.:
C8H9ClFNO5S
Mol. Mass.:
285.677
SMILES:
C[C@]1(CCl)[C@@H](N2[C@@H]([C@@H](F)C2=O)S1(=O)=O)C(O)=O
: