Target
Beta-lactamase 1
Ligand
BDBM50285116
Substrate
Meas. Tech.
ChEBML_40228
IC50
>5000000±n/a nM
Citation
 Danelon, GOMata, EGMascaretti, OAGirardini, JMarro, MRoveri, OA Synthesis and β-lactamase inhibitory evaluation of novel 6α-halo-2β-chloromethyl-2α-methylpenam-3α-carboxylic acids and their sulfones and 6α-halo-2β-mercaptobenzothiazolylmethyl-2α-methylpenam-3α-carboxylic acids Bioorg Med Chem Lett 5:2037-2040 (1995)    Article 
Target
Name:
Beta-lactamase 1
Synonyms:
BLAC_BACCE | blaY
Type:
PROTEIN
Mol. Mass.:
33326.66
Organism:
Bacillus cereus
Description:
ChEMBL_40230
Residue:
306
  
Inhibitor
Name:
BDBM50285116
Synonyms:
(2S,3R,5R,6S)-3-Chloromethyl-6-fluoro-3-methyl-7-oxo-4-thia-1-aza-bicyclo[3.2.0]heptane-2-carboxylic acid | CHEMBL304004
Type:
Small organic molecule
Emp. Form.:
C8H9ClFNO3S
Mol. Mass.:
253.678
SMILES:
C[C@@]1(CCl)S[C@@H]2[C@@H](F)C(=O)N2[C@H]1C(O)=O
: