Target
Prostaglandin G/H synthase 1
Ligand
BDBM50285225
Substrate
Meas. Tech.
ChEBML_51690
IC50
32000±n/a nM
Citation
 Leblanc, YGauthier, JEthier, DGuay, JMancini, JRiendeau, DTagari, PVickers, PWong, EPrasit, P Synthesis and biological evaluation of 2,3-diarylthiophenes as selective Cox-2 and Cox-1 inhibitors Bioorg Med Chem Lett 5:2123-2128 (1995)    Article 
Target
Name:
Prostaglandin G/H synthase 1
Synonyms:
COX-1 Cyclooxygenase Cyclooxygenase-1 (COX-1) PTGS1 | Prostaglandin G/H synthase (cyclooxygenase)
Type:
Enzyme
Mol. Mass.:
68692.62
Organism:
Homo sapiens (Human)
Description:
P23219
Residue:
599
  
Inhibitor
Name:
BDBM50285225
Synonyms:
2-(4-Fluoro-phenyl)-3-(4-methaneselenonyl-phenyl)-thiophene | CHEMBL69053
Type:
Small organic molecule
Emp. Form.:
C17H13FO2SSe
Mol. Mass.:
379.31
SMILES:
C[Se](=O)(=O)c1ccc(cc1)-c1ccsc1-c1ccc(F)cc1
: