Target
D(3) dopamine receptor
Ligand
BDBM50285659
Substrate
Meas. Tech.
ChEMBL_58776 (CHEMBL666891)
Ki
15±n/a nM
Citation
 Wright, JHeffner, TPugsley, TMacKenzie, RWise, L Discovery of selective dopamine D3 ligands: II. 2-[4-[3-(4-aryl-1-piperazinyl)propoxy]phenyl]benzimidazole partial agonists Bioorg Med Chem Lett 5:2547-2550 (1995)    Article 
Target
Name:
D(3) dopamine receptor
Synonyms:
DOPAMINE D3 DRD3_HUMAN Dopamine D3 receptor (D3) Dopamine receptor Dopamine receptor D3
Type:
Mol. Mass.:
44243.43
Organism:
Homo sapiens (Human)
Description:
Residue:
400
  
Inhibitor
Name:
BDBM50285659
Synonyms:
2-{4-[3-(4-Pyrimidin-2-yl-piperazin-1-yl)-propoxy]-phenyl}-1H-benzoimidazole | CHEMBL85972
Type:
Small organic molecule
Emp. Form.:
C24H26N6O
Mol. Mass.:
414.5028
SMILES:
C(COc1ccc(cc1)-c1nc2ccccc2[nH]1)CN1CCN(CC1)c1ncccn1
: