Target
D(2) dopamine receptor
Ligand
BDBM50285659
Substrate
Meas. Tech.
ChEMBL_58460 (CHEMBL670391)
Ki
269±n/a nM
Citation
 Wright, JHeffner, TPugsley, TMacKenzie, RWise, L Discovery of selective dopamine D3 ligands: II. 2-[4-[3-(4-aryl-1-piperazinyl)propoxy]phenyl]benzimidazole partial agonists Bioorg Med Chem Lett 5:2547-2550 (1995)    Article 
Target
Name:
D(2) dopamine receptor
Synonyms:
D(2) dopamine receptor DOPAMINE D2 Long DRD2 Dopamine D2 receptor Dopamine D2 receptor (D2R) Dopamine2-like | d2
Type:
Cell-surface receptors
Mol. Mass.:
50647.10
Organism:
Homo sapiens (Human)
Description:
P14416
Residue:
443
  
Inhibitor
Name:
BDBM50285659
Synonyms:
2-{4-[3-(4-Pyrimidin-2-yl-piperazin-1-yl)-propoxy]-phenyl}-1H-benzoimidazole | CHEMBL85972
Type:
Small organic molecule
Emp. Form.:
C24H26N6O
Mol. Mass.:
414.5028
SMILES:
C(COc1ccc(cc1)-c1nc2ccccc2[nH]1)CN1CCN(CC1)c1ncccn1
: