Target
D(3) dopamine receptor
Ligand
BDBM50285662
Substrate
Meas. Tech.
ChEMBL_58776 (CHEMBL666891)
Ki
2000±n/a nM
Citation
 Wright, JHeffner, TPugsley, TMacKenzie, RWise, L Discovery of selective dopamine D3 ligands: II. 2-[4-[3-(4-aryl-1-piperazinyl)propoxy]phenyl]benzimidazole partial agonists Bioorg Med Chem Lett 5:2547-2550 (1995)    Article 
Target
Name:
D(3) dopamine receptor
Synonyms:
DOPAMINE D3 DRD3_HUMAN Dopamine D3 receptor (D3) Dopamine receptor Dopamine receptor D3
Type:
Mol. Mass.:
44243.43
Organism:
Homo sapiens (Human)
Description:
Residue:
400
  
Inhibitor
Name:
BDBM50285662
Synonyms:
2-{4-[3-(4-Methyl-piperazin-1-yl)-propoxy]-phenyl}-1H-benzoimidazole | CHEMBL85700
Type:
Small organic molecule
Emp. Form.:
C21H26N4O
Mol. Mass.:
350.4573
SMILES:
CN1CCN(CCCOc2ccc(cc2)-c2nc3ccccc3[nH]2)CC1
: