Target
D(2) dopamine receptor
Ligand
BDBM50285662
Substrate
Meas. Tech.
ChEMBL_58460 (CHEMBL670391)
Ki
>3333±n/a nM
Citation
 Wright, JHeffner, TPugsley, TMacKenzie, RWise, L Discovery of selective dopamine D3 ligands: II. 2-[4-[3-(4-aryl-1-piperazinyl)propoxy]phenyl]benzimidazole partial agonists Bioorg Med Chem Lett 5:2547-2550 (1995)    Article 
Target
Name:
D(2) dopamine receptor
Synonyms:
D(2) dopamine receptor DOPAMINE D2 Long DRD2 Dopamine D2 receptor Dopamine D2 receptor (D2R) Dopamine2-like | d2
Type:
Cell-surface receptors
Mol. Mass.:
50647.10
Organism:
Homo sapiens (Human)
Description:
P14416
Residue:
443
  
Inhibitor
Name:
BDBM50285662
Synonyms:
2-{4-[3-(4-Methyl-piperazin-1-yl)-propoxy]-phenyl}-1H-benzoimidazole | CHEMBL85700
Type:
Small organic molecule
Emp. Form.:
C21H26N4O
Mol. Mass.:
350.4573
SMILES:
CN1CCN(CCCOc2ccc(cc2)-c2nc3ccccc3[nH]2)CC1
: