Target
D(3) dopamine receptor
Ligand
BDBM50285664
Substrate
Meas. Tech.
ChEMBL_58776 (CHEMBL666891)
Ki
130±n/a nM
Citation
 Wright, JHeffner, TPugsley, TMacKenzie, RWise, L Discovery of selective dopamine D3 ligands: II. 2-[4-[3-(4-aryl-1-piperazinyl)propoxy]phenyl]benzimidazole partial agonists Bioorg Med Chem Lett 5:2547-2550 (1995)    Article 
Target
Name:
D(3) dopamine receptor
Synonyms:
DOPAMINE D3 DRD3_HUMAN Dopamine D3 receptor (D3) Dopamine receptor Dopamine receptor D3
Type:
Mol. Mass.:
44243.43
Organism:
Homo sapiens (Human)
Description:
Residue:
400
  
Inhibitor
Name:
BDBM50285664
Synonyms:
2-(4-{3-[4-(4-Methoxy-phenyl)-piperazin-1-yl]-propoxy}-phenyl)-1H-benzoimidazole | CHEMBL312877
Type:
Small organic molecule
Emp. Form.:
C27H30N4O2
Mol. Mass.:
442.5527
SMILES:
COc1ccc(cc1)N1CCN(CCCOc2ccc(cc2)-c2nc3ccccc3[nH]2)CC1
: