Target
D(2) dopamine receptor
Ligand
BDBM50285663
Substrate
Meas. Tech.
ChEMBL_58460 (CHEMBL670391)
Ki
1403±n/a nM
Citation
 Wright, JHeffner, TPugsley, TMacKenzie, RWise, L Discovery of selective dopamine D3 ligands: II. 2-[4-[3-(4-aryl-1-piperazinyl)propoxy]phenyl]benzimidazole partial agonists Bioorg Med Chem Lett 5:2547-2550 (1995)    Article 
Target
Name:
D(2) dopamine receptor
Synonyms:
D(2) dopamine receptor DOPAMINE D2 Long DRD2 Dopamine D2 receptor Dopamine D2 receptor (D2R) Dopamine2-like | d2
Type:
Cell-surface receptors
Mol. Mass.:
50647.10
Organism:
Homo sapiens (Human)
Description:
P14416
Residue:
443
  
Inhibitor
Name:
BDBM50285663
Synonyms:
2-(4-{3-[4-(3-Chloro-phenyl)-piperazin-1-yl]-propoxy}-phenyl)-1H-benzoimidazole | CHEMBL84819
Type:
Small organic molecule
Emp. Form.:
C26H27ClN4O
Mol. Mass.:
446.972
SMILES:
Clc1cccc(c1)N1CCN(CCCOc2ccc(cc2)-c2nc3ccccc3[nH]2)CC1
: