Target
D(3) dopamine receptor
Ligand
BDBM50285666
Substrate
Meas. Tech.
ChEMBL_58776 (CHEMBL666891)
Ki
27±n/a nM
Citation
 Wright, JHeffner, TPugsley, TMacKenzie, RWise, L Discovery of selective dopamine D3 ligands: II. 2-[4-[3-(4-aryl-1-piperazinyl)propoxy]phenyl]benzimidazole partial agonists Bioorg Med Chem Lett 5:2547-2550 (1995)    Article 
Target
Name:
D(3) dopamine receptor
Synonyms:
DOPAMINE D3 DRD3_HUMAN Dopamine D3 receptor (D3) Dopamine receptor Dopamine receptor D3
Type:
Mol. Mass.:
44243.43
Organism:
Homo sapiens (Human)
Description:
Residue:
400
  
Inhibitor
Name:
BDBM50285666
Synonyms:
2-(4-{3-[4-(4-Chloro-phenyl)-piperazin-1-yl]-propoxy}-phenyl)-1H-benzoimidazole | CHEMBL87260
Type:
Small organic molecule
Emp. Form.:
C26H27ClN4O
Mol. Mass.:
446.972
SMILES:
Clc1ccc(cc1)N1CCN(CCCOc2ccc(cc2)-c2nc3ccccc3[nH]2)CC1
: