Target
Mu-type opioid receptor
Ligand
BDBM50286106
Substrate
Meas. Tech.
ChEBML_136091
IC50
0.150000±n/a nM
Citation
 Husbands, SMLewis, JW Morphinan cyclic imines and pyrrolidines containing a constrained phenyl group: High affinity opioid agonists Bioorg Med Chem Lett 5:2969-2974 (1995)    Article 
Target
Name:
Mu-type opioid receptor
Synonyms:
M-OR-1 Mu opioid receptor OPIATE Mu OPRM_CAVPO
Type:
Enzyme Catalytic Domain
Mol. Mass.:
11165.58
Organism:
GUINEA PIG
Description:
P97266
Residue:
98
  
Inhibitor
Name:
BDBM50286106
Synonyms:
CHEMBL321570 | Morphinan Cyclic Imine analogue
Type:
Small organic molecule
Emp. Form.:
C28H32N2O2
Mol. Mass.:
428.5659
SMILES:
COC12C=CC34C[C@@]1(C)[C@@H](N[C@H]2C31CCN(C)C4Cc2ccc(O)cc12)c1ccccc1
: