Target
Cholecystokinin receptor type A
Ligand
BDBM50286173
Substrate
Meas. Tech.
ChEBML_49403
IC50
2500±n/a nM
Citation
 Holladay, MWBennett, MJBai, HRalston, JWKerwin, JFStashko, MMiller, TRO'Neill, ABNadzan, AMBrioni, JLin, CW Amino acid-derived piperidides as novel CCKB ligands with anxiolytic-like properties Bioorg Med Chem Lett 5:3057-3062 (1995)    Article 
Target
Name:
Cholecystokinin receptor type A
Synonyms:
CCK-A receptor CCK1-R CCKAR_CAVPO Cholecystokinin receptor type A | Cholecystokinin-1 receptor
Type:
Mol. Mass.:
48229.77
Organism:
Cavia porcellus
Description:
Residue:
430
  
Inhibitor
Name:
BDBM50286173
Synonyms:
1-[(R)-1-(4-Benzoyl-piperidine-1-carbonyl)-pentyl]-3-m-tolyl-urea | CHEMBL101803
Type:
Small organic molecule
Emp. Form.:
C26H33N3O3
Mol. Mass.:
435.5585
SMILES:
CCCC[C@@H](NC(=O)Nc1cccc(C)c1)C(=O)N1CCC(CC1)C(=O)c1ccccc1
: