Target
Gastrin/cholecystokinin type B receptor
Ligand
BDBM50286149
Substrate
Meas. Tech.
ChEBML_49412
IC50
3900±n/a nM
Citation
 Holladay, MWBennett, MJBai, HRalston, JWKerwin, JFStashko, MMiller, TRO'Neill, ABNadzan, AMBrioni, JLin, CW Amino acid-derived piperidides as novel CCKB ligands with anxiolytic-like properties Bioorg Med Chem Lett 5:3057-3062 (1995)    Article 
Target
Name:
Gastrin/cholecystokinin type B receptor
Synonyms:
CCK-2 receptor CCK-BR CCKRB Cholecystokinin receptor GASR_HUMAN | Gastrin/cholecystokinin type B receptor
Type:
G Protein-Coupled Receptor (GPCR)
Mol. Mass.:
48445.79
Organism:
Homo sapiens (Human)
Description:
Stable expression of human CCK-2 receptors in HEK 293 cells.
Residue:
447
  
Inhibitor
Name:
BDBM50286149
Synonyms:
1-[(R)-1-(4-Benzoyl-piperidine-1-carbonyl)-3-phenyl-propyl]-3-m-tolyl-urea | CHEMBL105527
Type:
Small organic molecule
Emp. Form.:
C30H33N3O3
Mol. Mass.:
483.6013
SMILES:
Cc1cccc(NC(=O)N[C@H](CCc2ccccc2)C(=O)N2CCC(CC2)C(=O)c2ccccc2)c1
: