Target
Integrin alpha-IIb/beta-3
Ligand
BDBM50287222
Substrate
Meas. Tech.
ChEMBL_70337 (CHEMBL678842)
IC50
40±n/a nM
Citation
 Klein, SIMolino, BFCzekaj, MDener, JSLeadley, RJSabatino, RDunwiddie, CTChu, V Non-peptide fibrinogen receptor antagonists based upon a 4-substituted piperidine scaffold Bioorg Med Chem Lett 6:1403-1408 (1996)    Article 
Target
Name:
Integrin alpha-IIb/beta-3
Synonyms:
Glycoprotein IIb/IIIa
Type:
Mol. Mass.:
Description:
ASSAY_ID of EBI is 30109
Components:
This complex has 2 components.
Component 1
Name:
Integrin beta-3
Synonyms:
CD_antigen=CD61 GPIIIa ITGB3 Platelet membrane glycoprotein IIIa
Type:
Protein
Mol. Mass.:
87038.91
Organism:
Homo sapiens (Human)
Description:
P05106
Residue:
788
  
Component 2
Name:
Integrin alpha-IIb
Synonyms:
CD_antigen=CD41 GPIIb Glycoprotein IIb ITGA2B Integrin alpha-IIb heavy chain Integrin alpha-IIb light chain, form 2 Integrin alpha-V/beta-3 and alpha-IIb/beta 3 | Platelet membrane glycoprotein IIb
Type:
Protein
Mol. Mass.:
113354.85
Organism:
Homo sapiens (Human)
Description:
P08514
Residue:
1039
  
Inhibitor
Name:
BDBM50287222
Synonyms:
(S)-2-(Naphthalene-1-sulfonylamino)-5-oxo-5-[4-(3-piperidin-4-yl-propyl)-piperidin-1-yl]-pentanoic acid | CHEMBL32626
Type:
Small organic molecule
Emp. Form.:
C28H39N3O5S
Mol. Mass.:
529.691
SMILES:
OC(=O)[C@H](CCC(=O)N1CCC(CCCC2CCNCC2)CC1)NS(=O)(=O)c1cccc2ccccc12
: