Target
Subtilisin BL
Ligand
BDBM26996
Substrate
Meas. Tech.
ChEMBL_197707 (CHEMBL801819)
Ki
141000±n/a nM
Citation
 Stabile, MRLai, WGDeSantis, GGold, MJones, JBMitchinson, CBott, RRGraycar, TPLiu, CC Probing the specificity of the S1 binding site of M222 mutants of subtilisin B. lentus with boronic acid inhibitors Bioorg Med Chem Lett 6:2501-2506 (1996)    Article 
Target
Name:
Subtilisin BL
Synonyms:
SUBB_LEDLE | Subtilisin
Type:
PROTEIN
Mol. Mass.:
26829.89
Organism:
Bacillus lentus
Description:
ChEMBL_197707
Residue:
269
  
Inhibitor
Name:
BDBM26996
Synonyms:
CHEMBL21485 Phenyl-boronic acid benzeneboronic acid phenylboronic acid
Type:
Emp. Form.:
C6H7BO2
Mol. Mass.:
121.93
SMILES:
OB(O)c1ccccc1
: