Target
5-hydroxytryptamine receptor 3A
Ligand
BDBM50288285
Substrate
Meas. Tech.
ChEBML_3407
Kd
0.150000±n/a nM
Citation
 Paulis, TdTrivedi, BLZhang, ZJSchmidt, DEEbert, MHHewlett, WA (S)-4-amino-5-chloro-3-iodo-2-methoxy-N-(1-azabicyclo[2.2.2]oct-3-yl)benzamide (TRIZAC), a high-affinity ligand for the 5-HT-3 receptor Bioorg Med Chem Lett 6:2657-2662 (1996)    Article 
Target
Name:
5-hydroxytryptamine receptor 3A
Synonyms:
5-HT3 5HT3A_RAT Htr3 Serotonin (5-HT) receptor | Zacopride site-R
Type:
Enzyme Catalytic Domain
Mol. Mass.:
55428.70
Organism:
RAT
Description:
5-HT3 HTR3A RAT::P35563
Residue:
483
  
Inhibitor
Name:
BDBM50288285
Synonyms:
CHEMBL90314 | N-(S)-1-Aza-bicyclo[2.2.2]oct-3-yl-5-chloro-3-iodo-2-methoxy-benzamide
Type:
Small organic molecule
Emp. Form.:
C15H18ClIN2O2
Mol. Mass.:
420.673
SMILES:
COc1c(I)cc(Cl)cc1C(=O)N[C@@H]1CN2CCC1CC2
: