Target
Endothelin-1 receptor
Ligand
BDBM50288558
Substrate
Meas. Tech.
ChEMBL_65478 (CHEMBL873600)
IC50
>25000±n/a nM
Citation
 Cheng, XMLee, CKlutchko, SWinters, TReynolds, EEWelch, KMFlynn, MADoherty, AM Synthesis and structure-activity relationships of 9-substituted acridines as endothelin-A receptor antagonists Bioorg Med Chem Lett 6:2999-3002 (1996)    Article 
Target
Name:
Endothelin-1 receptor
Synonyms:
EDNRA ET-A ETA-R Endothelin receptor type A hET-AR
Type:
Enzyme Catalytic Domain
Mol. Mass.:
48736.88
Organism:
Homo sapiens (Human)
Description:
P25101
Residue:
427
  
Inhibitor
Name:
BDBM50288558
Synonyms:
Acridin-9-yl-benzo[1,3]dioxol-5-yl-acetic acid 4-chloro-benzyl ester | CHEMBL101292
Type:
Small organic molecule
Emp. Form.:
C29H20ClNO4
Mol. Mass.:
481.926
SMILES:
Clc1ccc(COC(=O)C(c2ccc3OCOc3c2)c2c3ccccc3nc3ccccc23)cc1
: