Target
Carbonic anhydrase 2
Ligand
BDBM50288859
Substrate
Meas. Tech.
ChEBML_45054
Kd
160±n/a nM
Citation
 Sigal, GBWhitesides, GM Benzenesulfonamide-peptide conjugates as probes for secondary binding sites near the active site of carbonic anhydrase Bioorg Med Chem Lett 6:559-564 (1996)    Article 
Target
Name:
Carbonic anhydrase 2
Synonyms:
CA-II CAC Carbonate dehydratase II Carbonic anhydrase 2 (CA-II) Carbonic anhydrase C Carbonic anhydrase II (CA-II) Carbonic anhydrase II (hCA II) | Carbonic anhydrase isoenzyme II (hCA II)
Type:
Enzyme
Mol. Mass.:
29250.71
Organism:
Homo sapiens (Human)
Description:
P00918
Residue:
260
  
Inhibitor
Name:
BDBM50288859
Synonyms:
4-Methylsulfanyl-2-(2-{2-[2-(4-sulfamoyl-benzoylamino)-acetylamino]-acetylamino}-acetylamino)-butyric acid | CHEMBL2371094
Type:
Small organic molecule
Emp. Form.:
C16H22N4O7S2
Mol. Mass.:
446.498
SMILES:
CSCC[C@@H](NC(=O)CNC(=O)CNC(=O)c1ccc(cc1)S(N)(=O)=O)C(O)=O
: