Target
Endothelin-converting enzyme 1
Ligand
BDBM50288963
Substrate
Meas. Tech.
ChEBML_64369
IC50
6500±n/a nM
Citation
 Kukkola, PJBilci, NAKozak, WXSavage, PJeng, AY Optimization of retro-thiorphan for inhibition of endothelin converting enzyme Bioorg Med Chem Lett 6:619-624 (1996)    Article 
Target
Name:
Endothelin-converting enzyme 1
Synonyms:
ECE-1 ECE1_HUMAN Endothelin-converting enzyme 1 (ECE1)
Type:
Enzyme
Mol. Mass.:
87155.11
Organism:
Homo sapiens (Human)
Description:
P42892
Residue:
770
  
Inhibitor
Name:
BDBM50288963
Synonyms:
2-(4-Benzyloxy-phenyl)-N-[(R)-2-(1H-indol-3-yl)-1-mercaptomethyl-ethyl]-acetamide | CHEMBL346494
Type:
Small organic molecule
Emp. Form.:
C26H26N2O2S
Mol. Mass.:
430.562
SMILES:
SC[C@@H](Cc1c[nH]c2ccccc12)NC(=O)Cc1ccc(OCc2ccccc2)cc1
: