Target
MHC class II antigen
Ligand
BDBM50289263
Substrate
Meas. Tech.
ChEMBL_192856 (CHEMBL799390)
IC50
300000±n/a nM
Citation
 Cunningham, BRRivetna, MTolman, RLFlattery, SJNichols, EASchwartz, CDWicker, LSHermes, JDJones, AB SAR for MHC class II binding tetrapeptides: Correlation with potential binding site Bioorg Med Chem Lett 7:19-24 (1997)    Article 
Target
Name:
MHC class II antigen
Synonyms:
DR-1 HLA class II histocompatibility antigen DRB1-1 Human leukocyte antigen DR beta chain | MHC class I antigen DRB1*1
Type:
PROTEIN
Mol. Mass.:
29917.79
Organism:
Homo sapiens (Human)
Description:
ChEMBL_192854
Residue:
266
  
Inhibitor
Name:
BDBM50289263
Synonyms:
((R)-{(S)-1-[(S)-1-((S)-1-Carbamoyl-3-methyl-butylcarbamoyl)-ethylcarbamoyl]-2-methyl-propylcarbamoyl}-phenyl-methyl)-carbamic acid ethyl ester | CHEMBL76717
Type:
Small organic molecule
Emp. Form.:
C25H39N5O6
Mol. Mass.:
505.6071
SMILES:
CCOC(=O)N[C@@H](C(=O)N[C@@H](C(C)C)C(=O)N[C@@H](C)C(=O)N[C@@H](CC(C)C)C(N)=O)c1ccccc1
: