Target
MHC class II antigen
Ligand
BDBM50289284
Substrate
Meas. Tech.
ChEMBL_192856 (CHEMBL799390)
IC50
38000±n/a nM
Citation
 Cunningham, BRRivetna, MTolman, RLFlattery, SJNichols, EASchwartz, CDWicker, LSHermes, JDJones, AB SAR for MHC class II binding tetrapeptides: Correlation with potential binding site Bioorg Med Chem Lett 7:19-24 (1997)    Article 
Target
Name:
MHC class II antigen
Synonyms:
DR-1 HLA class II histocompatibility antigen DRB1-1 Human leukocyte antigen DR beta chain | MHC class I antigen DRB1*1
Type:
PROTEIN
Mol. Mass.:
29917.79
Organism:
Homo sapiens (Human)
Description:
ChEMBL_192854
Residue:
266
  
Inhibitor
Name:
BDBM50289284
Synonyms:
(S)-2-((S)-3-Carbamoyl-2-{(S)-2-[((R)-2-ethoxycarbonylamino-propionyl)-methyl-amino]-5-guanidino-pentanoylamino}-propionylamino)-3-methyl-butyric acid | CHEMBL309211
Type:
Small organic molecule
Emp. Form.:
C22H40N8O8
Mol. Mass.:
544.6018
SMILES:
CCOC(=O)N[C@H](C)C(=O)N(C)[C@@H](CCCNC(N)=N)C(=O)N[C@@H](CC(N)=O)C(=O)N[C@@H](C(C)C)C(O)=O
: