Target
Plasminogen
Ligand
BDBM50289436
Substrate
Meas. Tech.
ChEBML_222787
IC50
14±n/a nM
Citation
 Tamura, SYShamblin, BMBrunck, TKRipka, WC RATIONAL DESIGN, SYNTHESIS, AND SERINE PROTEASE INHIBITORY ACTIVITY OF NOVEL P1-ARGININOYL HETEROCYCLES Bioorg Med Chem Lett 7:1359-1364 (1997)    Article 
Target
Name:
Plasminogen
Synonyms:
PLMN_RAT Plasminogen | Plg
Type:
Protein
Mol. Mass.:
90541.87
Organism:
Rattus norvegicus
Description:
Q01177
Residue:
812
  
Inhibitor
Name:
BDBM50289436
Synonyms:
(S)-2-((R)-2-Acetylamino-3-phenyl-propionylamino)-N-[(S)-1-(benzooxazole-2-carbonyl)-4-guanidino-butyl]-3-naphthalen-1-yl-propionamide; TFA | CHEMBL28968
Type:
Small organic molecule
Emp. Form.:
C37H39N7O5
Mol. Mass.:
661.7495
SMILES:
CC(=O)N[C@H](Cc1ccccc1)C(=O)N[C@@H](Cc1cccc2ccccc12)C(=O)N[C@@H](CCCNC(N)=N)C(=O)c1nc2ccccc2o1
: