Target
Voltage-dependent L-type calcium channel subunit alpha-1C
Ligand
BDBM50214773
Substrate
Meas. Tech.
ChEBML_53042
IC50
270±n/a nM
Citation
 Straub, AGoehrt, ABorn, L 4-Biaryl-substituted dihydropyridines with an unusual antiperiplanar conformation Bioorg Med Chem Lett 7:2519-2522 (1997)    Article 
Target
Name:
Voltage-dependent L-type calcium channel subunit alpha-1C
Synonyms:
CAC1C_HUMAN CACN2 CACNL1A1 Calcium channel (Type L) L-type calcium channel alpha-1c/beta-2/alpha2delta-1 Voltage-gated L-type calcium channel Voltage-gated calcium channel | Voltage-gated calcium channel subunit alpha Cav1.2
Type:
Enzyme Catalytic Domain
Mol. Mass.:
248979.79
Organism:
Homo sapiens (Human)
Description:
Calcium channel (Type L) 0 HUMAN::Q13936
Residue:
2221
  
Inhibitor
Name:
BDBM50214773
Synonyms:
CHEMBL3392229
Type:
Small organic molecule
Emp. Form.:
C26H23N3O2
Mol. Mass.:
409.4797
SMILES:
CCOC(=O)C1=C(C)NC(C)=C(C#N)[C@@H]1c1cnccc1-c1cccc2ccccc12
: