Target
Integrin alpha-IIb/beta-3
Ligand
BDBM50290321
Substrate
Meas. Tech.
ChEBML_218224
IC50
41±n/a nM
Citation
 Fisher, MJGunn, BPHarms, CSKline, ADMullaney, JTScarborough, RMSkelton, MAUm, SLUtterback, BGJakubowski, JA Dihydroisoquinolone RGD mimics. Exploration of the aspartate isostere Bioorg Med Chem Lett 7:2537-2542 (1997)    Article 
Target
Name:
Integrin alpha-IIb/beta-3
Synonyms:
Glycoprotein IIb/IIIa
Type:
Mol. Mass.:
Description:
ASSAY_ID of EBI is 30109
Components:
This complex has 2 components.
Component 1
Name:
Integrin beta-3
Synonyms:
CD_antigen=CD61 GPIIIa ITGB3 Platelet membrane glycoprotein IIIa
Type:
Protein
Mol. Mass.:
87038.91
Organism:
Homo sapiens (Human)
Description:
P05106
Residue:
788
  
Component 2
Name:
Integrin alpha-IIb
Synonyms:
CD_antigen=CD41 GPIIb Glycoprotein IIb ITGA2B Integrin alpha-IIb heavy chain Integrin alpha-IIb light chain, form 2 Integrin alpha-V/beta-3 and alpha-IIb/beta 3 | Platelet membrane glycoprotein IIb
Type:
Protein
Mol. Mass.:
113354.85
Organism:
Homo sapiens (Human)
Description:
P08514
Residue:
1039
  
Inhibitor
Name:
BDBM50290321
Synonyms:
3-[6-(4-Carbamimidoyl-benzyloxy)-1-oxo-3,4-dihydro-1H-isoquinolin-2-yl]-nonanoic acid | CHEMBL85627
Type:
Small organic molecule
Emp. Form.:
C26H33N3O4
Mol. Mass.:
451.5579
SMILES:
CCCCCCC(CC(O)=O)N1CCc2cc(OCc3ccc(cc3)C(N)=N)ccc2C1=O
: