Target
Integrin alpha-IIb/beta-3
Ligand
BDBM50290328
Substrate
Meas. Tech.
ChEBML_155511
IC50
100±n/a nM
Citation
 Fisher, MJGunn, BPHarms, CSKline, ADMullaney, JTScarborough, RMSkelton, MAUm, SLUtterback, BGJakubowski, JA Dihydroisoquinolone RGD mimics. Exploration of the aspartate isostere Bioorg Med Chem Lett 7:2537-2542 (1997)    Article 
Target
Name:
Integrin alpha-IIb/beta-3
Synonyms:
Glycoprotein IIb/IIIa
Type:
Mol. Mass.:
Description:
ASSAY_ID of EBI is 30109
Components:
This complex has 2 components.
Component 1
Name:
Integrin beta-3
Synonyms:
CD_antigen=CD61 GPIIIa ITGB3 Platelet membrane glycoprotein IIIa
Type:
Protein
Mol. Mass.:
87038.91
Organism:
Homo sapiens (Human)
Description:
P05106
Residue:
788
  
Component 2
Name:
Integrin alpha-IIb
Synonyms:
CD_antigen=CD41 GPIIb Glycoprotein IIb ITGA2B Integrin alpha-IIb heavy chain Integrin alpha-IIb light chain, form 2 Integrin alpha-V/beta-3 and alpha-IIb/beta 3 | Platelet membrane glycoprotein IIb
Type:
Protein
Mol. Mass.:
113354.85
Organism:
Homo sapiens (Human)
Description:
P08514
Residue:
1039
  
Inhibitor
Name:
BDBM50290328
Synonyms:
CHEMBL87318 | [(5S,8S,14S,22R,24aS)-22-Carbamoyl-14-(3-guanidino-propyl)-5-(1H-indol-3-ylmethyl)-21,21-dimethyl-4,7,10,13,16,24-hexaoxo-docosahydro-19,20-dithia-3a,6,9,12,15,23-hexaaza-cyclopentacyclotricosen-8-yl]-acetic acid
Type:
Small organic molecule
Emp. Form.:
C36H51N11O9S2
Mol. Mass.:
845.988
SMILES:
CC1(C)SSCCC(=O)N[C@@H](CCCNC(N)=N)C(=O)NCC(=O)N[C@@H](CC(O)=O)C(=O)N[C@@H](Cc2c[nH]c3ccccc23)C(=O)N2CCC[C@H]2C(=O)N[C@@H]1C(N)=O
: