Target
D(2) dopamine receptor
Ligand
BDBM50290513
Substrate
Meas. Tech.
ChEBML_58600
Ki
0.060000±n/a nM
Citation
 Diouf, OCarato, PDepreux, PBonte, JPCaignard, DHGuardiola-Lemaître, BRettori, MCBelzung, CLesieur, D 5-HT1A and 5-HT2A ligands with anxiolytic and antipanic-like properties Bioorg Med Chem Lett 7:2579-2584 (1997)    Article 
Target
Name:
D(2) dopamine receptor
Synonyms:
DOPAMINE D2 DOPAMINE D2 Short Dopamine D2 receptor Drd2
Type:
G Protein-Coupled Receptor (GPCR)
Mol. Mass.:
50931.60
Organism:
Rattus norvegicus (rat)
Description:
P61169
Residue:
444
  
Inhibitor
Name:
BDBM50290513
Synonyms:
1-{2-[4-(4-Fluoro-benzoyl)-piperidin-1-yl]-ethyl}-6-{4-[4-(2-methoxy-phenyl)-piperazin-1-yl]-butyl}-1,4-dihydro-benzo[d][1,3]oxazin-2-one | CHEMBL85580
Type:
Small organic molecule
Emp. Form.:
C37H45FN4O4
Mol. Mass.:
628.776
SMILES:
COc1ccccc1N1CCN(CCCCc2ccc3N(CCN4CCC(CC4)C(=O)c4ccc(F)cc4)C(=O)OCc3c2)CC1
: