Target
Epidermal growth factor receptor
Ligand
BDBM50290631
Substrate
Meas. Tech.
ChEBML_66598
IC50
6.4±n/a nM
Citation
 Gibson, KHGrundy, WGodfrey, AAWoodburn, JRAshton, SECurry, BJScarlett, LBarker, AJBrown, DS Epidermal growth factor receptor tyrosine kinase: Structure-activity relationships and antitumour activity of novel quinazolines Bioorg Med Chem Lett 7:2723-2728 (1997)    Article 
Target
Name:
Epidermal growth factor receptor
Synonyms:
EGF Receptor Substrate EGFR_HUMAN ERBB1 Epidermal Growth Factor Receptor erbB-1 Epidermal growth factor receptor (EGFR) HER1 Proto-oncogene c-ErbB-1 Tyrosine-Protein Kinase ErbB-1
Type:
Receptor Kinase Domain
Mol. Mass.:
134279.59
Organism:
Homo sapiens (Human)
Description:
P00533
Residue:
1210
  
Inhibitor
Name:
BDBM50290631
Synonyms:
(6,7-Dimethoxy-quinazolin-4-yl)-isoquinolin-4-yl-amine | CHEMBL329867
Type:
Small organic molecule
Emp. Form.:
C19H16N4O2
Mol. Mass.:
332.3559
SMILES:
COc1cc2ncnc(Nc3cncc4ccccc34)c2cc1OC
: