Target
D(2) dopamine receptor
Ligand
BDBM50041961
Substrate
Meas. Tech.
ChEBML_63051
Ki
15±n/a nM
Citation
 Stjernlöf, PLin, CHSonesson, CSvensson, KSmith, MW (Dipropylamino)-tetrahydronaphthofurans: centrally acting serotonin agonists and dopamine agonists-antagonists Bioorg Med Chem Lett 7:2759-2764 (1997)    Article 
Target
Name:
D(2) dopamine receptor
Synonyms:
DOPAMINE D2 DOPAMINE D2 Short Dopamine D2 receptor Drd2
Type:
G Protein-Coupled Receptor (GPCR)
Mol. Mass.:
50931.60
Organism:
Rattus norvegicus (rat)
Description:
P61169
Residue:
444
  
Inhibitor
Name:
BDBM50041961
Synonyms:
((1S,2R)-5-Methoxy-1-methyl-1,2,3,4-tetrahydro-naphthalen-2-yl)-dipropyl-amine (1S,2R)-(5-Methoxy-1-methyl-1,2,3,4-tetrahydro-naphthalen-2-yl)-dipropyl-amine CHEMBL278751 | UH-232
Type:
Small organic molecule
Emp. Form.:
C18H29NO
Mol. Mass.:
275.429
SMILES:
CCCN(CCC)[C@@H]1CCc2c(OC)cccc2[C@@H]1C
: