Target
D(3) dopamine receptor
Ligand
BDBM50133917
Substrate
Meas. Tech.
ChEBML_62936
Ki
27±n/a nM
Citation
 Stjernlöf, PLin, CHSonesson, CSvensson, KSmith, MW (Dipropylamino)-tetrahydronaphthofurans: centrally acting serotonin agonists and dopamine agonists-antagonists Bioorg Med Chem Lett 7:2759-2764 (1997)    Article 
Target
Name:
D(3) dopamine receptor
Synonyms:
DOPAMINE D3 DRD3_HUMAN Dopamine D3 receptor (D3) Dopamine receptor Dopamine receptor D3
Type:
Mol. Mass.:
44243.43
Organism:
Homo sapiens (Human)
Description:
Residue:
400
  
Inhibitor
Name:
BDBM50133917
Synonyms:
((6S,7R)-6-Methyl-6,7,8,9-tetrahydro-naphtho[1,2-b]furan-7-yl)-dipropyl-amine | CHEMBL433002
Type:
Small organic molecule
Emp. Form.:
C19H27NO
Mol. Mass.:
285.4238
SMILES:
CCCN(CCC)[C@@H]1CCc2c(ccc3ccoc23)[C@@H]1C
: