Target
D(3) dopamine receptor
Ligand
BDBM50290666
Substrate
Meas. Tech.
ChEBML_62936
Ki
45±n/a nM
Citation
 Stjernlöf, PLin, CHSonesson, CSvensson, KSmith, MW (Dipropylamino)-tetrahydronaphthofurans: centrally acting serotonin agonists and dopamine agonists-antagonists Bioorg Med Chem Lett 7:2759-2764 (1997)    Article 
Target
Name:
D(3) dopamine receptor
Synonyms:
DOPAMINE D3 DRD3_HUMAN Dopamine D3 receptor (D3) Dopamine receptor Dopamine receptor D3
Type:
Mol. Mass.:
44243.43
Organism:
Homo sapiens (Human)
Description:
Residue:
400
  
Inhibitor
Name:
BDBM50290666
Synonyms:
CHEMBL314548 | Dipropyl-(6,7,8,9-tetrahydro-naphtho[2,1-b]furan-8-yl)-amine
Type:
Small organic molecule
Emp. Form.:
C18H25NO
Mol. Mass.:
271.3972
SMILES:
CCCN(CCC)C1CCc2ccc3occc3c2C1
: