Target
5-hydroxytryptamine receptor 1A
Ligand
BDBM50290665
Substrate
Meas. Tech.
ChEBML_590
Ki
210±n/a nM
Citation
 Stjernlöf, PLin, CHSonesson, CSvensson, KSmith, MW (Dipropylamino)-tetrahydronaphthofurans: centrally acting serotonin agonists and dopamine agonists-antagonists Bioorg Med Chem Lett 7:2759-2764 (1997)    Article 
Target
Name:
5-hydroxytryptamine receptor 1A
Synonyms:
5-HT-1A 5-hydroxytryptamine receptor 1A (5-HT-1A) ADRB2RL1 Dopamine D2 receptor and serotonin 1a receptor HTR1A | Serotonin receptor 1A
Type:
Mol. Mass.:
46122.49
Organism:
Homo sapiens (Human)
Description:
Residue:
422
  
Inhibitor
Name:
BDBM50290665
Synonyms:
CHEMBL96735 | Dipropyl-(6,7,8,9-tetrahydro-naphtho[1,2-b]furan-7-yl)-amine
Type:
Small organic molecule
Emp. Form.:
C18H25NO
Mol. Mass.:
271.3972
SMILES:
CCCN(CCC)C1CCc2c(C1)ccc1ccoc21
: